BDBM20779 8-[(7-chloro-1,3-benzothiazol-2-yl)sulfanyl]-9-[2-(cyclopropylamino)ethyl]-9H-purin-6-amine::Benzothiazole analogue, 37::CHEMBL215947
SMILES Nc1ncnc2n(CCNC3CC3)c(Sc3nc4cccc(Cl)c4s3)nc12
InChI Key InChIKey=YAEFGNPDRFBMQN-UHFFFAOYSA-N
Data  1 IC50  1 EC50
  Tab Delimited (TSV)   2D SDfile   Computed 3D by Vconf -m prep SDfile
Find this compound or compounds like it in BindingDB:
Activity Spreadsheet -- Enzyme Inhibition Constant Data from BindingDB
Found 2 hits for monomerid = 20779
TargetHeat shock protein HSP 90-beta(Homo sapiens (Human))
Memorial Sloan-Kettering Cancer Center
Curated by ChEMBL
LigandPNGBDBM20779(8-[(7-chloro-1,3-benzothiazol-2-yl)sulfanyl]-9-[2-...)
Affinity DataIC50:  110nM. Assay description: Inhibition of Hsp90 in human MCF7 cells assessed as Her2 degradation
In DepthDetails ArticlePubMed
TargetHeat shock protein HSP 90-beta(Homo sapiens (Human))
Memorial Sloan-Kettering Cancer Center
Curated by ChEMBL
LigandPNGBDBM20779(8-[(7-chloro-1,3-benzothiazol-2-yl)sulfanyl]-9-[2-...)
Affinity DataEC50:  110nM. Assay description: EC50 was defined as the concentration of the compound at which there was 50% degradation of the Her-2/neu protein in MCF7 breast carcinoma cells. Sam...
In DepthDetails ArticlePubMed