BDBM207906 US9546153, ex. 42
SMILES CC(C)(O)[C@H](F)CNC(=O)c1cnc(Nc2ccc3ncsc3c2)cc1NC1CC1
InChI Key InChIKey=SHENXRCDBJGWNU-GOSISDBHSA-N
Data  5 IC50
PDB links: 1 PDB ID matches this monomer.
  Tab Delimited (TSV)   2D SDfile   Computed 3D by Vconf -m prep SDfile
Find this compound or compounds like it in BindingDB:
Activity Spreadsheet -- Enzyme Inhibition Constant Data from BindingDB
Found 5 hits for monomerid = 207906
TargetInterleukin-1 receptor-associated kinase 4(Homo sapiens (Human))
Bristol-Myers Squibb
US Patent
LigandPNGBDBM207906(US9546153, ex. 42)
Affinity DataIC50:  2.70nMpH: 7.2 T: 2°C. Assay description: The assays were performed in U-bottom 384-well plates. The final assay volume was 30 μL prepared from 15 μL additions of enzyme and substra...
Ligand InfoPC cidPC sidPDB
TargetInterleukin-1 receptor-associated kinase 4(Homo sapiens (Human))
Bristol-Myers Squibb
US Patent
LigandPNGBDBM207906(US9546153, ex. 42)
Affinity DataIC50:  2.40nM. Assay description: Inhibition of IRAK4 (unknown origin) using FL-IPTSPITTTYFFFKKK peptide and ATP as substrate incubated for 60 mins by fluorescence based caliper assay
Ligand InfoPC cidPC sidPDB
TargetInterleukin-1 receptor-associated kinase 4(Mus musculus)
Biocon Bristol Myers Squibb Research Center
Curated by ChEMBL
LigandPNGBDBM207906(US9546153, ex. 42)
Affinity DataIC50:  240nM. Assay description: Inhibition of IRAK4 in mouse whole blood
Ligand InfoPC cidPC sidPDB
TargetInterleukin-1 receptor-associated kinase 4(Homo sapiens (Human))
Bristol-Myers Squibb
US Patent
LigandPNGBDBM207906(US9546153, ex. 42)
Affinity DataIC50:  810nM. Assay description: Inhibition of IRAK4 in human whole blood assessed as inhibition of LTA-induced IL-6 production preincubated for 30 mins followed by LTA-stimulation a...
Ligand InfoPC cidPC sidPDB
TargetInterleukin-1 receptor-associated kinase 4(Homo sapiens (Human))
Bristol-Myers Squibb
US Patent
LigandPNGBDBM207906(US9546153, ex. 42)
Affinity DataIC50:  230nM. Assay description: Inhibition of IRAK4 in human PBMC assessed as inhibition of LTA-induced IL-6 production preincubated for 30 mins followed by LTA-stimulation and meas...
Ligand InfoPC cidPC sidPDB