BDBM20870 3-{2-[(thiophene-2-sulfonyl)methyl]-1,3-thiazol-4-yl}-1,2-dihydroquinolin-2-one::quinolin-2(1H)-one derivative, 17l
SMILES O=c1[nH]c2ccccc2cc1-c1csc(CS(=O)(=O)c2cccs2)n1
InChI Key InChIKey=MCZGHPQYRSSJLZ-UHFFFAOYSA-N
Data  1 IC50
  Tab Delimited (TSV)   2D SDfile   Computed 3D by Vconf -m prep SDfile
Find this compound or compounds like it in BindingDB:
Activity Spreadsheet -- Enzyme Inhibition Constant Data from BindingDB
Found 1 hit for monomerid = 20870
TargetCyclin-dependent kinase 5 activator 1 [99-307](Homo sapiens (Human))
Amgen
LigandPNGBDBM20870(3-{2-[(thiophene-2-sulfonyl)methyl]-1,3-thiazol-4-...)
Affinity DataIC50:  2.10nMT: 2°C. Assay description: In vitro CDK assay using purified enzyme, was incubated at 25 °C with substrate, and test compounds in the presence of ATP/ [gamma-33P] ATP. 33P...
In DepthDetails ArticlePubMed