BDBM209221 US9266877, 167
SMILES Cc1c(cnn1CC1(CCCCC1)OCCN1CCS(=O)(=O)CC1)-c1ccc(nc1C(O)=O)N1CCc2cccc(C(=O)Nc3nc4ccccc4s3)c2C1
InChI Key InChIKey=KYWJHTVSQLDUGT-UHFFFAOYSA-N
Data  1 KI  1 EC50
  Tab Delimited (TSV)   2D SDfile   Computed 3D by Vconf -m prep SDfile
Find this compound or compounds like it in BindingDB:
Activity Spreadsheet -- Enzyme Inhibition Constant Data from BindingDB
Found 2 hits for monomerid = 209221
TargetBcl-2-like protein 1(Homo sapiens (Human))
Abbvie
US Patent
LigandPNGBDBM209221(US9266877, 167)
Affinity DataKi: <0.100nM ΔG°: <-13.6kcal/moleT: 2°C. Assay description: The measurement of competition of compounds of Formula (I) with F-Bak for a Bcl-2 family protein (Bcl-xL) binding site using a Time Resolved Fluoresc...
Ligand InfoPC cidPC sid
In DepthDetails US Patent
TargetBcl-2-like protein 1(Mus musculus (Mouse))
Abbvie
US Patent
LigandPNGBDBM209221(US9266877, 167)
Affinity DataEC50:  81nM. Assay description: The efficacy of the compounds of Formula (I) can also be determined in cell-based killing assays using a variety of cell lines and mouse tumor models...
Ligand InfoPC cidPC sid
In DepthDetails US Patent