BDBM212628 US9278954, 1.19
SMILES CCCNc1nccc(N2CC[C@H](C2)Oc2ccc(cc2)C(C)C(=O)NCCF)c1F
InChI Key InChIKey=MVLJQNZGOWDXTD-LRTDYKAYSA-N
Data  1 IC50
  Tab Delimited (TSV)   2D SDfile   Computed 3D by Vconf -m prep SDfile
Find this compound or compounds like it in BindingDB:
Activity Spreadsheet -- Enzyme Inhibition Constant Data from BindingDB
Found 1 hit for monomerid = 212628
TargetAcetyl-CoA carboxylase 2 [129-967](Homo sapiens (Human))
Boehringer Ingelheim International
US Patent
LigandPNGBDBM212628(US9278954, 1.19)
Affinity DataIC50:  296nMpH: 7.5Assay Description:Malonyl CoA formation by acetyl CoA carboxylases is stoichometrically linked to the consumption of ATP. ACC2 activity is measured in a NADH-linked ki...
Ligand InfoPC cidPC sid
In DepthDetails US Patent