BDBM212705 US9278954, 2.3
SMILES CCCN(C)c1nccc(n1)N1CC[C@H](C1)Oc1ccc(cc1)C(C)C(=O)NCC
InChI Key InChIKey=VZBHETLTABRWDP-UUSAFJCLSA-N
Data  1 IC50
  Tab Delimited (TSV)   2D SDfile   Computed 3D by Vconf -m prep SDfile
Find this compound or compounds like it in BindingDB:
Activity Spreadsheet -- Enzyme Inhibition Constant Data from BindingDB
Found 1 hit for monomerid = 212705
TargetAcetyl-CoA carboxylase 2 [129-967](Homo sapiens (Human))
Boehringer Ingelheim International
US Patent
LigandPNGBDBM212705(US9278954, 2.3)
Affinity DataIC50:  188nMpH: 7.5Assay Description:Malonyl CoA formation by acetyl CoA carboxylases is stoichometrically linked to the consumption of ATP. ACC2 activity is measured in a NADH-linked ki...
Ligand InfoPC cidPC sid
In DepthDetails US Patent