BDBM212717 US9278954, 3.3
SMILES CCCNc1ncnc(N2CC[C@H](C2)Oc2ccc(cc2)C(C)C(=O)NC2CC2)c1F
InChI Key InChIKey=LSPQNXZXLIOLBQ-XCWJXAQQSA-N
Data  1 IC50
  Tab Delimited (TSV)   2D SDfile   Computed 3D by Vconf -m prep SDfile
Find this compound or compounds like it in BindingDB:
Activity Spreadsheet -- Enzyme Inhibition Constant Data from BindingDB
Found 1 hit for monomerid = 212717
TargetAcetyl-CoA carboxylase 2 [129-967](Homo sapiens (Human))
Boehringer Ingelheim International
US Patent
LigandPNGBDBM212717(US9278954, 3.3)
Affinity DataIC50:  280nMpH: 7.5Assay Description:Malonyl CoA formation by acetyl CoA carboxylases is stoichometrically linked to the consumption of ATP. ACC2 activity is measured in a NADH-linked ki...
Ligand InfoPC cidPC sid
In DepthDetails US Patent