BDBM212757 US9278954, 7.1
SMILES CCNC(=O)C(C)c1ccc(O[C@@H]2CCN(C2)c2ccc(OC3CCC3)cc2)cc1
InChI Key InChIKey=QUUJUPNQYDYUTO-VCUSLETLSA-N
Data  1 IC50
  Tab Delimited (TSV)   2D SDfile   Computed 3D by Vconf -m prep SDfile
Find this compound or compounds like it in BindingDB:
Activity Spreadsheet -- Enzyme Inhibition Constant Data from BindingDB
Found 1 hit for monomerid = 212757
TargetAcetyl-CoA carboxylase 2 [129-967](Homo sapiens (Human))
Boehringer Ingelheim International
US Patent
LigandPNGBDBM212757(US9278954, 7.1)
Affinity DataIC50:  41nMpH: 7.5Assay Description:Malonyl CoA formation by acetyl CoA carboxylases is stoichometrically linked to the consumption of ATP. ACC2 activity is measured in a NADH-linked ki...
Ligand InfoPC cidPC sid
In DepthDetails US Patent