BDBM212758 US9556111, Table 1.23::US9951033, Compound Table 1.21
SMILES Cc1ccc(NC(=O)Nc2ccc(CN(Cc3ccccc3)Cc3ccc(NC(=O)Nc4ccc(C)cc4)cc3)cc2)cc1
InChI Key InChIKey=GDOGNDIWWBUHNX-UHFFFAOYSA-N
Data  2 EC50
  Tab Delimited (TSV)   2D SDfile   Computed 3D by Vconf -m prep SDfile
Find this compound or compounds like it in BindingDB:
Activity Spreadsheet -- Enzyme Inhibition Constant Data from BindingDB
Found 2 hits for monomerid = 212758
TargetA-kinase anchor protein 7 isoform gamma(Mus musculus (Mouse))
Universitetet I Oslo
US Patent
LigandPNGBDBM212758(US9556111, Table 1.23 | US9951033, Compound Table ...)
Affinity DataEC50:  2.50E+3nM. Assay description: Stable and optimal assay conditions were determined by cross-titrating GST-AKAP18 δ and biotinylated PLB using 10 μg/ml glutathione accepto...
Ligand InfoPC cidPC sid
In DepthDetails US Patent
TargetA-kinase anchor protein 7 isoform gamma(Homo sapiens (Human))
Universitetet I Oslo
US Patent
LigandPNGBDBM212758(US9556111, Table 1.23 | US9951033, Compound Table ...)
Affinity DataEC50:  2.50E+3nM. Assay description: Stable and optimal assay conditions were determined by cross-titrating GST-AKAP18δ and biotinylated PLB using 10 μg/ml glutathione acceptor...
Ligand InfoPC cidPC sid
In DepthDetails US Patent