BDBM213127 US9278960, 8-34::US9636337, 8-34
SMILES COc1ccc(cc1)-c1cc(nc2cc(ccc12)C(C)Cc1cnc(nc1)C#N)C(N)=O
InChI Key InChIKey=FNLRSUUOKIOXRC-UHFFFAOYSA-N
Data  3 IC50
  Tab Delimited (TSV)   2D SDfile   Computed 3D by Vconf -m prep SDfile
Find this compound or compounds like it in BindingDB:
Activity Spreadsheet -- Enzyme Inhibition Constant Data from BindingDB
Found 3 hits for monomerid = 213127
LigandPNGBDBM213127(US9278960, 8-34 | US9636337, 8-34)
Affinity DataIC50:  8nM. Assay description: The utility of the compounds in accordance with the present invention as antagonists of metabotropic glutamate receptor activity, in particular mGluR...
Ligand InfoPC cidPC sid
In DepthDetails US Patent
TargetMetabotropic glutamate receptor 2(Homo sapiens (Human))
Merck Sharp & Dohme
US Patent
LigandPNGBDBM213127(US9278960, 8-34 | US9636337, 8-34)
Affinity DataIC50:  8nM. Assay description: The utility of the compounds in accordance with the present invention as antagonists of metabotropic glutamate receptor activity, in particular mGluR...
Ligand InfoPC cidPC sid
In DepthDetails US Patent
TargetMetabotropic glutamate receptor 2(Homo sapiens (Human))
Merck Sharp & Dohme
US Patent
LigandPNGBDBM213127(US9278960, 8-34 | US9636337, 8-34)
Affinity DataIC50:  8nM. Assay description: The utility of the compounds in accordance with the present invention as antagonists of metabotropic glutamate receptor activity, in particular mGluR...
Ligand InfoPC cidPC sid
In DepthDetails US Patent