BDBM213237 4-Methylumbelliferyl phosphate
SMILES Cc1cc(=O)oc2cc(OP([O-])([O-])=O)ccc12
InChI Key InChIKey=BCHIXGBGRHLSBE-UHFFFAOYSA-L
Data  1 Kd  1 ITC
  Tab Delimited (TSV)   2D SDfile   Computed 3D by Vconf -m prep SDfile
Find this compound or compounds like it in BindingDB:
Activity Spreadsheet -- Enzyme Inhibition Constant Data from BindingDB
Found 1 hit for monomerid = 213237
TargetN-acetyltransferase domain-containing protein(Pseudomonas aeruginosa)
University Of Virginia
LigandPNGBDBM213237(4-Methylumbelliferyl phosphate)
Affinity DataKd:  1.65E+5nMpH: 7.5 T: 2°C. Assay description: Isothermal titration calorimetry (ITC) measurements were performed at 25 °C using an iTC200 calorimeter (MicroCal). Preparations of purified pr...
In DepthDetails ArticlePubMed
Activity Spreadsheet -- ITC Data from BindingDB
Found 1 hit for monomerid = 213237
SyringePNGBDBM213237(4-Methylumbelliferyl phosphate)
ITC DataΔG°: -5.18kcal/mole −TΔS°: 3.96kcal/mole ΔH°: -9.14kcal/mole logk: 6.26E+3
pH: 7.5 T: 25.00°C
In DepthDetails ArticlePubMed