BDBM21430 4-Piperidinebenzylidene derivative, 10i::N-[(4-{[(2R)-4-(dimethylamino)-1-(phenylsulfanyl)butan-2-yl]amino}-3-nitrobenzene)sulfonyl]-4-[4-(pyridin-2-ylmethylidene)piperidin-1-yl]benzamide
SMILES [#6]-[#7](-[#6])-[#6]-[#6]-[#6@H](-[#6]-[#16]-c1ccccc1)-[#7]-c1ccc(cc1-[#7+](-[#8-])=O)S(=O)(=O)[#7]-[#6](=O)-c1ccc(cc1)-[#7]-1-[#6]-[#6]\[#6](-[#6]-[#6]-1)=[#6]/c1ccccn1
InChI Key InChIKey=AXRKKWXXRAOBEV-SSEXGKCCSA-N
Data  2 KI  1 IC50  3 EC50
  Tab Delimited (TSV)   2D SDfile   Computed 3D by Vconf -m prep SDfile
Find this compound or compounds like it in BindingDB:
Activity Spreadsheet -- Enzyme Inhibition Constant Data from BindingDB
Found 3 hits for monomerid = 21430
TargetBcl-2-like protein 1(Homo sapiens (Human))
Abbott Laboratories
LigandPNGBDBM21430(4-Piperidinebenzylidene derivative, 10i | N-[(4-{[...)
Affinity DataKi:  3.60nM IC50:  700nM EC50:  550nM. Assay description: The binding affinities (Ki) of compounds were determined using fluorescence polarization assays (FPA) that measure their ability to competitively dis...
In DepthDetails ArticlePubMed
TargetApoptosis regulator Bcl-2(Homo sapiens (Human))
Abbott Laboratories
LigandPNGBDBM21430(4-Piperidinebenzylidene derivative, 10i | N-[(4-{[...)
Affinity DataKi:  46nM EC50:  1.38E+3nM. Assay description: The binding affinities (Ki) of compounds were determined using fluorescence polarization assays (FPA) that measure their ability to competitively dis...
In DepthDetails ArticlePubMed
TargetBcl-2-like protein 1(Homo sapiens (Human))
Abbott Laboratories
LigandPNGBDBM21430(4-Piperidinebenzylidene derivative, 10i | N-[(4-{[...)
Affinity DataEC50:  550nM. Assay description: Inhibition of Bcl-XL
In DepthDetails ArticlePubMed