BDBM21467 2-benzyl-3-({1-[2-acetamido-3-(4-hydroxyphenyl)propanoyl]pyrrolidin-2-yl}(hydroxy)phosphoryl)propanoic acid::Phosphinic Peptide Inhibitor, 31
SMILES CC(=O)NC(Cc1ccc(O)cc1)C(=O)N1CCC=C1P(O)(O)CC(Cc1ccccc1)C(O)=O
InChI Key InChIKey=JALBXOJCOAUIGU-UHFFFAOYSA-N
Data  1 KI
  Tab Delimited (TSV)   2D SDfile   Computed 3D by Vconf -m prep SDfile
Find this compound or compounds like it in BindingDB:
Activity Spreadsheet -- Enzyme Inhibition Constant Data from BindingDB
Found 1 hit for monomerid = 21467
TargetAngiotensin-converting enzyme 2(Homo sapiens (Human))
University Of Athens
LigandPNGBDBM21467(2-benzyl-3-({1-[2-acetamido-3-(4-hydroxyphenyl)pro...)
Affinity DataKi:  5.20nM ΔG°:  -11.3kcal/molepH: 6.8 T: 2°C. Assay description: Continuous assays were performed by recording the fluorescence increase at 405 nm (excitation@ 320 nm) induced by the cleavage of fluorogenic substra...
In DepthDetails ArticlePubMed