BDBM21513 7-[3-(1-methylpyrrolidin-2-yl)propoxy]-4-[2-(pyridin-2-yl)-4H,5H,6H-pyrrolo[1,2-a]pyrazol-3-yl]quinoline::Dihydropyrrolopyrazole, 19
SMILES CN1CCCC1CCCOc1ccc2c(ccnc2c1)-c1c2CCCn2nc1-c1ccccn1
InChI Key InChIKey=JXPPWBILJRHGIF-UHFFFAOYSA-N
Data  1 IC50  1 EC50
  Tab Delimited (TSV)   2D SDfile   Computed 3D by Vconf -m prep SDfile
Find this compound or compounds like it in BindingDB:
Activity Spreadsheet -- Enzyme Inhibition Constant Data from BindingDB
Found 1 hit for monomerid = 21513
TargetTGF-beta receptor type-1 [4-503,T204D](Homo sapiens (Human))
Eli Lilly
LigandPNGBDBM21513(7-[3-(1-methylpyrrolidin-2-yl)propoxy]-4-[2-(pyrid...)
Affinity DataIC50:  72nM EC50:  17nMpH: 7.5 T: 2°C. Assay description: The kinase activity was assayed by the autophosphorylation reaction of ALK5 (T204D) in the presence of 4 uM ATP and [33P]-gamma-ATP. After incubation...
In DepthDetails ArticlePubMed