BDBM21729 ((2R,3S)-3-Fluoro-2-methylhexadecanoyl-CoA, 5
SMILES CCCCCCCCCCCCC[C@H](F)[C@@H](C)C(=O)SCCNC(=O)CCNC(=O)C(O)C(C)(C)COP(O)(=O)OP(O)(=O)OC[C@H]1O[C@H]([C@H](O)[C@@H]1OP(O)(O)=O)n1cnc2c(N)ncnc12
InChI Key InChIKey=RWSHUYKIAIDBCL-AWIIAEAWSA-N
Data  1 KI
  Tab Delimited (TSV)   2D SDfile   Computed 3D by Vconf -m prep SDfile
Find this compound or compounds like it in BindingDB:
Activity Spreadsheet -- Enzyme Inhibition Constant Data from BindingDB
Found 1 hit for monomerid = 21729
TargetAlpha-methylacyl-CoA racemase(Rattus norvegicus (rat))
University Of Liverpool
LigandPNGBDBM21729(((2R,3S)-3-Fluoro-2-methylhexadecanoyl-CoA, 5)
Affinity DataKi:  1.30E+3nM ΔG°:  -8.35kcal/molepH: 7.0 T: 2°C. Assay description: AMACR activity was determined by monitoring the interconversion of the (25R/S)-isomer of THC-CoA. Reaction product was analyzed by resolution of (25S...
In DepthDetails ArticlePubMed