BDBM21736 2-methylmyristoyl CoA, 22
SMILES CCCCCCCCCCCCC(C)C(=O)SCCNC(=O)CCNC(=O)C(O)C(C)(C)COP(O)(=O)OP(O)(=O)OC[C@H]1O[C@H]([C@H](O)[C@@H]1OP(O)(O)=O)n1cnc2c(N)ncnc12
InChI Key InChIKey=KJEFZXSIQKASDI-KKCGVLJOSA-N
Data  1 KI
PDB links: 1 PDB ID matches this monomer.
  Tab Delimited (TSV)   2D SDfile   Computed 3D by Vconf -m prep SDfile
Find this compound or compounds like it in BindingDB:
Activity Spreadsheet -- Enzyme Inhibition Constant Data from BindingDB
Found 1 hit for monomerid = 21736
TargetAlpha-methylacyl-CoA racemase(Rattus norvegicus (rat))
University Of Liverpool
LigandPNGBDBM21736(2-methylmyristoyl CoA, 22)
Affinity DataKi:  1.37E+5nM ΔG°:  -5.48kcal/molepH: 7.0 T: 2°C. Assay description: AMACR activity was determined by monitoring the interconversion of the (25R/S)-isomer of THC-CoA. Reaction product was analyzed by resolution of (25S...
In DepthDetails ArticlePubMed