BDBM218759 US9296757, 81
SMILES CN1CCN(CC1CCO)C(=O)C1CCc2c(C1)sc1ncnc(Nc3ccc4[nH]c(=O)sc4c3)c21
InChI Key
Data  1 IC50
  Tab Delimited (TSV)   2D SDfile   Computed 3D by Vconf -m prep SDfile
Find this compound or compounds like it in BindingDB:
Activity Spreadsheet -- Enzyme Inhibition Constant Data from BindingDB
Found 1 hit for monomerid = 218759
LigandPNGBDBM218759(US9296757, 81)
Affinity DataIC50:  34nMpH: 7.5 T: 2°C. Assay description: For the assay 50 nL of a 100 fold concentrated solution of the test compound in DMSO was pipetted into a black low volume 384 well microtiter plate (...
Ligand InfoPC cidPC sid
In DepthDetails US Patent