BDBM218980 US9303033, H6, Table 19A, Compound 7
SMILES Clc1cccc(Nc2cc(NCc3ccccn3)n3ncc(\C=C4/NC(=O)NC4=O)c3n2)c1
InChI Key InChIKey=CHEJAVBQMRDDMQ-IUXPMGMMSA-N
Data  2 IC50
  Tab Delimited (TSV)   2D SDfile   Computed 3D by Vconf -m prep SDfile
Find this compound or compounds like it in BindingDB:
Activity Spreadsheet -- Enzyme Inhibition Constant Data from BindingDB
Found 2 hits for monomerid = 218980
TargetCasein kinase II subunit beta(Homo sapiens (Human))
Senhwa Biosciences
US Patent
LigandPNGBDBM218980(US9303033, H6, Table 19A, Compound 7)
Affinity DataIC50:  421nMpH: 7.0Assay Description:5 uM ATP: Test compounds dissolved and diluted in DMSO (2 μl) were added to a reaction mixture comprising 10 μl of 5× Reaction Buffer (40 m...
Ligand InfoPC cidPC sid
In DepthDetails US Patent
TargetCasein kinase II subunit alpha/beta(Homo sapiens (Human))
Senhwa Biosciences
US Patent
LigandPNGBDBM218980(US9303033, H6, Table 19A, Compound 7)
Affinity DataIC50: <1.00E+3nMpH: 7.2Assay Description:In a final reaction volume of 50 μl, CK2 ααββ (4 ng, 8.5 mU) was incubated with various concentrations of test compounds in ...
Ligand InfoPC cidPC sid
In DepthDetails US Patent