BDBM219957 US9303033, H44, Table 50A, Compound 39
SMILES O=C1NC(=O)\C(N1)=C\c1cnn2c(NC3CC3)cc(nc12)N1CCC(CC1)c1cccc(c1)C#N
InChI Key InChIKey=RHEVFVQVEVEUDA-JAIQZWGSSA-N
Data  1 IC50
  Tab Delimited (TSV)   2D SDfile   Computed 3D by Vconf -m prep SDfile
Find this compound or compounds like it in BindingDB:
Activity Spreadsheet -- Enzyme Inhibition Constant Data from BindingDB
Found 1 hit for monomerid = 219957
TargetCasein kinase II subunit alpha/beta(Homo sapiens (Human))
Senhwa Biosciences
US Patent
LigandPNGBDBM219957(US9303033, H44, Table 50A, Compound 39)
Affinity DataIC50: <100nMpH: 7.2Assay Description:In a final reaction volume of 50 μl, CK2 ααββ (4 ng, 8.5 mU) was incubated with various concentrations of test compounds in ...
Ligand InfoPC cidPC sid
In DepthDetails US Patent