BDBM220118 US9271961, EM1404
SMILES C[C@@]12CCC3C(CCc4cc(ccc34)C(N)=O)C1CC[C@@]21CCC(C)(C)C(=O)O1
InChI Key InChIKey=YVAJWBACBRSVPR-MHHCKCGGSA-N
Data  1 KI
  Tab Delimited (TSV)   2D SDfile   Computed 3D by Vconf -m prep SDfile
Find this compound or compounds like it in BindingDB:
Activity Spreadsheet -- Enzyme Inhibition Constant Data from BindingDB
Found 1 hit for monomerid = 220118
TargetAldo-keto reductase family 1 member C3(Homo sapiens (Human))
University Of Pennsylvania
US Patent
LigandPNGBDBM220118(US9271961, EM1404)
Affinity DataKi:  6.90nM. Assay description: Compounds may be evaluated as selective reversible inhibitors of AKR1C3 by screening them against homogeneous recombinant AKR1C1-AKR1C4 expressed in ...
Ligand InfoPC cidPC sid
In DepthDetails US Patent