BDBM220400 US9296708, 6, ARM-P8
SMILES OC(=O)CC[C@H](NC(=O)N[C@@H](CCCCn1cc(COCCOCCOCCOCCOCCOCCOCCOCCNc2ccc(cc2[N+]([O-])=O)[N+]([O-])=O)nn1)C(O)=O)C(O)=O
InChI Key InChIKey=FYBZEJITZIQBMD-ACHIHNKUSA-N
Data  1 KI  2 IC50
  Tab Delimited (TSV)   2D SDfile   Computed 3D by Vconf -m prep SDfile
Find this compound or compounds like it in BindingDB:
Activity Spreadsheet -- Enzyme Inhibition Constant Data from BindingDB
Found 2 hits for monomerid = 220400
TargetDiacylglycerol O-acyltransferase 1(Homo sapiens (Human))
Yale University
US Patent
LigandPNGBDBM220400(US9296708, 6, ARM-P8)
Affinity DataKi:  0.145nM IC50:  3.29nM. Assay description: For IC50 measurements, inhibitors were dissolved in Reaction Buffer containing 40 μM NAAG to a final volume of 100 μL. Then, 25 μL of this s...
Ligand InfoPC cidPC sid
In DepthDetails US Patent
TargetGlutamate carboxypeptidase 2(Homo sapiens (Human))
Mcmaster University
Curated by ChEMBL
LigandPNGBDBM220400(US9296708, 6, ARM-P8)
Affinity DataIC50:  23nM. Assay description: Displacement of [125I]23 from PSMA in human LNCAP cells
Ligand InfoPC cidPC sid
In DepthDetails ArticlePubMed