BDBM22069 6-{[(4-chlorophenyl)methyl]amino}-9-(cyclohexylmethyl)-9H-purine-2-carbonitrile::Compound 3{10,15}
SMILES Clc1ccc(CNc2nc(nc3n(CC4CCCCC4)cnc23)C#N)cc1
InChI Key InChIKey=KEEIQIFZIITAFA-UHFFFAOYSA-N
Data  1 IC50
  Tab Delimited (TSV)   2D SDfile   Computed 3D by Vconf -m prep SDfile
Find this compound or compounds like it in BindingDB:
Activity Spreadsheet -- Enzyme Inhibition Constant Data from BindingDB
Found 1 hit for monomerid = 22069
TargetCathepsin B-like cysteine protease(Trypanosoma brucei)
University Of California San Francisco
LigandPNGBDBM22069(6-{[(4-chlorophenyl)methyl]amino}-9-(cyclohexylmet...)
Affinity DataIC50: >2.50E+4nMpH: 5.5 T: 2°C. Assay description: Enzyme activity was assayed in a 96-well plate format. TbcatB was incubated with inhibitor compound at room temperature for 20 min before the additio...
In DepthDetails ArticlePubMed