BDBM22080 6-(benzylamino)-9-(oxan-2-ylmethyl)-9H-purine-2-carbonitrile::Compound 3{8,9}
SMILES N#Cc1nc(NCc2ccccc2)c2ncn(CC3CCCCO3)c2n1
InChI Key InChIKey=WPDTYPDQZJAERM-UHFFFAOYSA-N
Data  1 IC50
  Tab Delimited (TSV)   2D SDfile   Computed 3D by Vconf -m prep SDfile
Find this compound or compounds like it in BindingDB:
Activity Spreadsheet -- Enzyme Inhibition Constant Data from BindingDB
Found 1 hit for monomerid = 22080
TargetCathepsin B-like cysteine protease(Trypanosoma brucei)
University Of California San Francisco
LigandPNGBDBM22080(6-(benzylamino)-9-(oxan-2-ylmethyl)-9H-purine-2-ca...)
Affinity DataIC50:  1.10E+4nMT: 2°C. Assay description: Enzyme activity was assayed in a 96-well plate format. TbcatB was incubated with inhibitor compound at room temperature for 20 min before the additio...
In DepthDetails ArticlePubMed