BDBM22087 6-{[(4-chlorophenyl)methyl]amino}-9-(3-hydroxypropyl)-9H-purine-2-carbonitrile::Compound 3{10,2}
SMILES OCCCn1cnc2c(NCc3ccc(Cl)cc3)nc(nc12)C#N
InChI Key InChIKey=YUWVGFWHMXEGHR-UHFFFAOYSA-N
Data  1 IC50
  Tab Delimited (TSV)   2D SDfile   Computed 3D by Vconf -m prep SDfile
Find this compound or compounds like it in BindingDB:
Activity Spreadsheet -- Enzyme Inhibition Constant Data from BindingDB
Found 1 hit for monomerid = 22087
TargetCathepsin B-like cysteine protease(Trypanosoma brucei)
University Of California San Francisco
LigandPNGBDBM22087(6-{[(4-chlorophenyl)methyl]amino}-9-(3-hydroxyprop...)
Affinity DataIC50:  570nMT: 2°C. Assay description: Enzyme activity was assayed in a 96-well plate format. TbcatB was incubated with inhibitor compound at room temperature for 20 min before the additio...
In DepthDetails ArticlePubMed