BDBM221022 US9302996, 137
SMILES Cc1cc(OCC2(CCC2)C(O)=O)ncc1-c1cnc(-c2ncc([nH]2)C(F)(F)F)c(F)c1
InChI Key InChIKey=WYYRKKQFJUHHJW-UHFFFAOYSA-N
Data  1 IC50
  Tab Delimited (TSV)   2D SDfile   Computed 3D by Vconf -m prep SDfile
Find this compound or compounds like it in BindingDB:
Activity Spreadsheet -- Enzyme Inhibition Constant Data from BindingDB
Found 1 hit for monomerid = 221022
TargetDiacylglycerol O-acyltransferase 1(Homo sapiens (Human))
Mitsubishi Tanabe Pharma
US Patent
LigandPNGBDBM221022(US9302996, 137)
Affinity DataIC50:  2nMpH: 7.4 T: 2°C. Assay description: As a buffer to be used in the enzymatic reaction of DGAT1, 100 mM Tris-HCl (pH 7.4), 200 mM Sucrose, 20 mM MgCl2, 0.125% Bovine Serum Albumin (BSA) w...
Ligand InfoPC cidPC sid
In DepthDetails US Patent