BDBM22162 sodium (3R,5S,6E)-7-[4-(4-fluorophenyl)-2-[N-(1-methyl-1H-1,2,4-triazol-5-yl)methanesulfonamido]-6-(propan-2-yl)pyrimidin-5-yl]-3,5-dihydroxyhept-6-enoate::triazole compound, 1c
SMILES CC(C)c1nc(nc(-c2ccc(F)cc2)c1\C=C\[C@@H](O)C[C@@H](O)CC(O)=O)N(c1ncnn1C)S(C)(=O)=O
InChI Key InChIKey=XDXJFEXLMAVNBO-AQRBRUGDSA-N
Data  1 IC50  1 EC50
  Tab Delimited (TSV)   2D SDfile   Computed 3D by Vconf -m prep SDfile
Find this compound or compounds like it in BindingDB:
Activity Spreadsheet -- Enzyme Inhibition Constant Data from BindingDB
Found 1 hit for monomerid = 22162
Target3-hydroxy-3-methylglutaryl-coenzyme A reductase(Rattus norvegicus (rat))
Bristol-Myers Squibb
LigandPNGBDBM22162(sodium (3R,5S,6E)-7-[4-(4-fluorophenyl)-2-[N-(1-me...)
Affinity DataIC50:  2.90nM EC50:  7.5nMpH: 7.0 T: 2°C. Assay description: Enzyme Assay for HMG-CoA reductase was based on the conversion of isotopically labeled HMG-CoA to mevalonic acid using rat liver microsomes as enzyme...
In DepthDetails ArticlePubMed