BDBM2223 2-Pyridinone derivative 21::3-[2-(4,7-dichloro-1,3-benzoxazol-2-yl)ethyl]-5-ethyl-6-methyl-1,2-dihydropyridin-2-one::CHEMBL99235::Pyridinone deriv. 16
SMILES CCc1cc(CCc2nc3c(Cl)ccc(Cl)c3o2)c(=O)[nH]c1C
InChI Key InChIKey=AFMYOEOCOWXZLE-UHFFFAOYSA-N
Data  3 IC50
  Tab Delimited (TSV)   2D SDfile   Computed 3D by Vconf -m prep SDfile
Find this compound or compounds like it in BindingDB:
Activity Spreadsheet -- Enzyme Inhibition Constant Data from BindingDB
Found 3 hits for monomerid = 2223
TargetGag-Pol polyprotein [588-1027]/[588-1147](Human immunodeficiency virus type 1)
Merck Sharp And Dohme Research Laboratories
LigandPNGBDBM2223(2-Pyridinone derivative 21 | 3-[2-(4,7-dichloro-1,...)
Affinity DataIC50:  9.60nMpH: 8.2Assay Description:The IC50 of reverse transcriptase is the concentration that inhibits 50% of recombinant HIV-1 RT RNA-directed DNA polymerase activity in vitro.
In DepthDetails ArticlePubMed
TargetReverse transcriptase/RNaseH(Human immunodeficiency virus 1)
Merck Reserch Laboratories
Curated by ChEMBL
LigandPNGBDBM2223(2-Pyridinone derivative 21 | 3-[2-(4,7-dichloro-1,...)
Affinity DataIC50:  14nM. Assay description: Tested for inhibition against HIV-1 RT (used (poly)rC-(oligo)dG as the template)
In DepthDetails ArticlePubMed
TargetGag-Pol polyprotein [588-1027]/[588-1147](Human immunodeficiency virus type 1)
Merck Sharp And Dohme Research Laboratories
LigandPNGBDBM2223(2-Pyridinone derivative 21 | 3-[2-(4,7-dichloro-1,...)
Affinity DataIC50:  14nM. Assay description: The IC50 of reverse transcriptase is the concentration that inhibits 50% of recombinant HIV-1 RT RNA-directed DNA polymerase activity in vitro.
In DepthDetails ArticlePubMed