BDBM223475 US9320734, 345
SMILES NS(=O)(=O)c1nnc(NS(=O)(=O)c2cccc3cccnc23)s1
InChI Key InChIKey=FZHGBFVLVKBLAD-UHFFFAOYSA-N
Data  1 IC50  1 Kd
  Tab Delimited (TSV)   2D SDfile   Computed 3D by Vconf -m prep SDfile
Find this compound or compounds like it in BindingDB:
Activity Spreadsheet -- Enzyme Inhibition Constant Data from BindingDB
Found 2 hits for monomerid = 223475
TargetRAC-alpha serine/threonine-protein kinase [1-123](Homo sapiens (Human))
The University Of Texas System
US Patent
LigandPNGBDBM223475(US9320734, 345)
Affinity DataIC50:  5.00E+4nM. Assay description: Inhibition of AKT was measured by Western blots using specific antibodies against phospho-Ser473-AKT in HT-29 lung cancer cells. Inhibition of the ph...
In DepthDetails US Patent
TargetRAC-alpha serine/threonine-protein kinase [1-123](Homo sapiens (Human))
The University Of Texas System
US Patent
LigandPNGBDBM223475(US9320734, 345)
Affinity DataKd:  1.79E+3nM. Assay description: SPR interaction analyses were performed with a Biacore 2000, using Biacore 2000 Control Software v3.2 and BIAevaluation v4.1 analysis software (Biaco...
In DepthDetails US Patent