BDBM224125 3-{6-[3-chloro-5- (hydroxymethyl)phen- yl]-7-[(trans-4- methylcyclohexyl) methyl]-8-[(3r)-3- phenylmorpholin-4- yl]-7h-purin-2-yl}- 1,2,4-oxadiazol- 5(4h)-one::US9540377, 16.44
SMILES C[C@H]1CC[C@H](Cn2c(nc3nc(nc(-c4cc(Cl)cc(CO)c4)c23)-c2noc(=O)[nH]2)N2CCOC[C@H]2c2ccccc2)CC1
InChI Key
Data  1 IC50
  Tab Delimited (TSV)   2D SDfile   Computed 3D by Vconf -m prep SDfile
Find this compound or compounds like it in BindingDB:
Activity Spreadsheet -- Enzyme Inhibition Constant Data from BindingDB
Found 1 hit for monomerid = 224125
TargetE3 ubiquitin-protein ligase Mdm2 [17-125](Homo sapiens (Human))
Merck Sharp & Dohme
US Patent
LigandPNGBDBM224125(3-{6-[3-chloro-5- (hydroxymethyl)phen- yl]-7-[(tra...)
Affinity DataIC50:  0.205nMT: 2°C. Assay description: An HDM2 FRET assay was developed to assess the compounds' inhibitory activity towards binding of p53 protein. A truncated version of HDM2 with re...
Ligand InfoPC cidPC sid
In DepthDetails US Patent