BDBM2246 2-Pyridinone derivative 26::3-[2-(1,3-benzoxazol-2-yl)ethyl]-5-ethyl-6-methyl-1,2-dihydropyridine-2-thione::3-[2-(Benzoxazol-2-yl)ethyl]-5-ethyl-6-methylpyridine-2(1H)-thione::CHEMBL172861
SMILES CCc1cc(CCc2nc3ccccc3o2)c(=S)[nH]c1C
InChI Key InChIKey=VRKMJGDGFOBMKJ-UHFFFAOYSA-N
Data  2 IC50
  Tab Delimited (TSV)   2D SDfile   Computed 3D by Vconf -m prep SDfile
Find this compound or compounds like it in BindingDB:
Activity Spreadsheet -- Enzyme Inhibition Constant Data from BindingDB
Found 2 hits for monomerid = 2246
TargetReverse transcriptase/RNaseH(Human immunodeficiency virus 1)
Merck Reserch Laboratories
Curated by ChEMBL
LigandPNGBDBM2246(2-Pyridinone derivative 26 | 3-[2-(1,3-benzoxazol-...)
Affinity DataIC50:  24nM. Assay description: Tested for inhibition against HIV-1 RT (used (poly)rC-(oligo)dG as the template)
In DepthDetails ArticlePubMed
TargetGag-Pol polyprotein [588-1027]/[588-1147](Human immunodeficiency virus type 1)
Merck Reserch Laboratories
Curated by ChEMBL
LigandPNGBDBM2246(2-Pyridinone derivative 26 | 3-[2-(1,3-benzoxazol-...)
Affinity DataIC50:  24nM. Assay description: The IC50 of reverse transcriptase is the concentration that inhibits 50% of recombinant HIV-1 RT RNA-directed DNA polymerase activity in vitro.
In DepthDetails ArticlePubMed