BDBM224625 US9328070, Reference compound 3
SMILES CC(C)(NC(=O)c1ccc(cn1)C#Cc1ccnc(Cl)c1)C(F)(F)F
InChI Key InChIKey=IHNZWKAGAISFBH-UHFFFAOYSA-N
Data  1 KI  1 EC50
  Tab Delimited (TSV)   2D SDfile   Computed 3D by Vconf -m prep SDfile
Find this compound or compounds like it in BindingDB:
Activity Spreadsheet -- Enzyme Inhibition Constant Data from BindingDB
Found 2 hits for monomerid = 224625
TargetIsoform 1 of Metabotropic glutamate receptor 5 (5a)(Homo sapiens (Human))
Hoffmann-La Roche
US Patent
LigandPNGBDBM224625(US9328070, Reference compound 3)
Affinity DataKi:  58nMpH: 7.4Assay Description:For binding experiments, cDNA encoding human mGlu 5a receptor was transiently transfected into EBNA cells using a procedure described by Schlaeger an...
Ligand InfoPC cidPC sid
In DepthDetails US Patent
TargetIsoform 1 of Metabotropic glutamate receptor 5 (5a)(Homo sapiens (Human))
Hoffmann-La Roche
US Patent
LigandPNGBDBM224625(US9328070, Reference compound 3)
Affinity DataEC50:  37nMT: 2°C. Assay description: A monoclonal HEK-293 cell line stably transfected with a cDNA encoding for the human mGlu5a receptor was generated; for the work with mGlu5 Positive ...
Ligand InfoPC cidPC sid
In DepthDetails US Patent