BDBM225288 1,1''-bis(2-Chlorobenzyl)-[3,3':3',3''-terindolin]-2'-one (4i)
SMILES Clc1ccccc1Cn1cc(c2ccccc12)C1(C(=O)Nc2ccccc12)c1cn(Cc2ccccc2Cl)c2ccccc12
InChI Key InChIKey=RTDPVDANHJSHSH-UHFFFAOYSA-N
Data  2 IC50
  Tab Delimited (TSV)   2D SDfile   Computed 3D by Vconf -m prep SDfile
Find this compound or compounds like it in BindingDB:
Activity Spreadsheet -- Enzyme Inhibition Constant Data from BindingDB
Found 2 hits for monomerid = 225288
TargetProbable maltase-glucoamylase 2(Homo sapiens)
Babasaheb Bhimrao Ambedkar University (A Central University)
Curated by ChEMBL
LigandPNGBDBM225288(1,1''-bis(2-Chlorobenzyl)-[3,3':3'...)
Affinity DataIC50:  5.90E+3nM. Assay description: Inhibition of alpha-glucosidase (unknown origin) using p-nitrophenyl-alpha-d-glucopyranoside as substrate preincubated for 15 mins followed by substr...
Ligand InfoPC cidPC sid
In DepthDetails ArticlePubMed
TargetAlpha-glucosidase MAL32(Saccharomyces cerevisiae)
Jishou University
LigandPNGBDBM225288(1,1''-bis(2-Chlorobenzyl)-[3,3':3'...)
Affinity DataIC50:  7.31E+3nMpH: 6.8 T: 2°C. Assay description: The α-glucosidase inhibition assay had been carried out using baker's yeast α-glucosidase (EC 3.2.1.20) and p-nitrophenyl α-d-gluco...
Ligand InfoPC cidPC sid
In DepthDetails