BDBM225327 CS148
SMILES [O-][N+](=O)c1cccc(c1)-c1noc(CCCN2C(=O)c3ccccc3C2=O)n1
InChI Key InChIKey=PQAOFJCRCDDOKZ-UHFFFAOYSA-N
Data  2 Kd
  Tab Delimited (TSV)   2D SDfile   Computed 3D by Vconf -m prep SDfile
Find this compound or compounds like it in BindingDB:
Activity Spreadsheet -- Enzyme Inhibition Constant Data from BindingDB
Found 2 hits for monomerid = 225327
TargetCyclin-dependent kinase 2(Homo sapiens (Human))
D3R/Abbott
LigandPNGBDBM225327(CS148)
Affinity DataKd: >1.00E+5nM. Assay description: OctetRed_Method1
In DepthDetails PubMed
TargetCyclin-dependent kinase 2(Homo sapiens (Human))
D3R/Abbott
LigandPNGBDBM225327(CS148)
Affinity DataKd: >1.00E+5nM. Assay description: OctetRed_Method1
In DepthDetails PubMed