BDBM225328 CS204
SMILES Cc1nonc1OCCNc1cc(ccc1[N+]([O-])=O)N1CCOCC1
InChI Key InChIKey=BGXBEMJCUUJCAD-UHFFFAOYSA-N
Data  2 Kd
  Tab Delimited (TSV)   2D SDfile   Computed 3D by Vconf -m prep SDfile
Find this compound or compounds like it in BindingDB:
Activity Spreadsheet -- Enzyme Inhibition Constant Data from BindingDB
Found 2 hits for monomerid = 225328
TargetCyclin-dependent kinase 2(Homo sapiens (Human))
D3R/Abbott
LigandPNGBDBM225328(CS204)
Affinity DataKd: >1.00E+5nM. Assay description: OctetRed_Method1
In DepthDetails PubMed
TargetCyclin-dependent kinase 2(Homo sapiens (Human))
D3R/Abbott
LigandPNGBDBM225328(CS204)
Affinity DataKd: >1.00E+5nM. Assay description: OctetRed_Method1
In DepthDetails PubMed