BDBM225337 Chk1_17
SMILES CCN1CCN(Cc2ccc3Cc4c(n[nH]c4-c4cccc(OC)c4)-c3c2)CC1
InChI Key InChIKey=VZQNXGODMDFVCD-UHFFFAOYSA-N
Data  1 KI
  Tab Delimited (TSV)   2D SDfile   Computed 3D by Vconf -m prep SDfile
Find this compound or compounds like it in BindingDB:
Activity Spreadsheet -- Enzyme Inhibition Constant Data from BindingDB
Found 1 hit for monomerid = 225337
TargetSerine/threonine-protein kinase Chk1 [2-280](Homo sapiens (Human))
D3R/Abbott
LigandPNGBDBM225337(Chk1_17)
Affinity DataKi:  3.95E+3nM. Assay description: 33P-Radiometric_Method1
Ligand InfoPC cidPC sid
In DepthDetails PubMed