BDBM225688 GTC000461A
SMILES Cc1cccc(c1)C(=O)NCCC1(CNc2ccc(cn2)C(N)=O)CCCCC1
InChI Key InChIKey=BAQVREQCCQUZHH-UHFFFAOYSA-N
Data  1 IC50
PDB links: 1 PDB ID matches this monomer.
  Tab Delimited (TSV)   2D SDfile   Computed 3D by Vconf -m prep SDfile
Find this compound or compounds like it in BindingDB:
Activity Spreadsheet -- Enzyme Inhibition Constant Data from BindingDB
Found 1 hit for monomerid = 225688
TargettRNA (guanine-N(1)-)-methyltransferase(Haemophilus influenzae (strain ATCC 51907 / DSM 11...)
D3R/Abbott
LigandPNGBDBM225688(GTC000461A)
Affinity DataIC50:  7.94E+3nM. Assay description: ScintillationProximity_Assay
Ligand InfoPC cidPC sidPDB