BDBM225712 hsp90_3
SMILES Oc1ccc(c(O)c1)-n1c2ccc(cc2[nH]c1=O)C(F)(F)F
InChI Key InChIKey=WJIZLIGWLXBSLO-UHFFFAOYSA-N
Data  1 IC50
  Tab Delimited (TSV)   2D SDfile   Computed 3D by Vconf -m prep SDfile
Find this compound or compounds like it in BindingDB:
Activity Spreadsheet -- Enzyme Inhibition Constant Data from BindingDB
Found 1 hit for monomerid = 225712
TargetHeat shock protein HSP 90-beta(Homo sapiens (Human))
D3R/Abbott
LigandPNGBDBM225712(hsp90_3)
Affinity DataIC50:  154nM. Assay description: FRET Assay 1
Ligand InfoPC cidPC sid
In DepthDetails PubMed