BDBM225721 hsp90_14
SMILES COC(=O)c1ccc2n(-c3cc(Br)c(O)cc3O)c(=O)[nH]c2c1
InChI Key InChIKey=KIHMPGKGTNSKSN-UHFFFAOYSA-N
Data  1 IC50
  Tab Delimited (TSV)   2D SDfile   Computed 3D by Vconf -m prep SDfile
Find this compound or compounds like it in BindingDB:
Activity Spreadsheet -- Enzyme Inhibition Constant Data from BindingDB
Found 1 hit for monomerid = 225721
TargetHeat shock protein HSP 90-beta(Homo sapiens (Human))
D3R/Abbott
LigandPNGBDBM225721(hsp90_14)
Affinity DataIC50:  40.4nM. Assay description: FRET Assay 1
Ligand InfoPC cidPC sid
In DepthDetails PubMed