BDBM225798 hsp90_89
SMILES CCNC(=O)CO\N=C\c1c(Cl)nc(N)nc1-c1ccc(Cl)cc1Cl
InChI Key InChIKey=KFTHWBAXCZFYML-AERZKKPOSA-N
Data  1 IC50
  Tab Delimited (TSV)   2D SDfile   Computed 3D by Vconf -m prep SDfile
Find this compound or compounds like it in BindingDB:
Activity Spreadsheet -- Enzyme Inhibition Constant Data from BindingDB
Found 1 hit for monomerid = 225798
TargetHeat shock protein HSP 90-beta(Homo sapiens (Human))
D3R/Abbott
LigandPNGBDBM225798(hsp90_89)
Affinity DataIC50:  144nM. Assay description: FRET Assay 1
Ligand InfoPC cidPC sid
In DepthDetails PubMed