BDBM225815 hsp90_106
SMILES Nc1nc(-c2ccc(Cl)cc2Cl)c2ncnn2n1
InChI Key InChIKey=CIGJSTPATDXTNF-UHFFFAOYSA-N
Data  1 IC50
  Tab Delimited (TSV)   2D SDfile   Computed 3D by Vconf -m prep SDfile
Find this compound or compounds like it in BindingDB:
Activity Spreadsheet -- Enzyme Inhibition Constant Data from BindingDB
Found 1 hit for monomerid = 225815
TargetHeat shock protein HSP 90-beta(Homo sapiens (Human))
D3R/Abbott
LigandPNGBDBM225815(hsp90_106)
Affinity DataIC50:  87.4nM. Assay description: FRET Assay 1
Ligand InfoPC cidPC sid
In DepthDetails PubMed