BDBM22595 3-[2-(4-tert-butylphenoxy)acetamido]benzoic acid::Compound DLC27
SMILES CC(C)(C)c1ccc(OCC(=O)Nc2cccc(c2)C(O)=O)cc1
InChI Key InChIKey=HBWHFUOANGBPBY-UHFFFAOYSA-N
Data  1 IC50  1 ITC
  Tab Delimited (TSV)   2D SDfile   Computed 3D by Vconf -m prep SDfile
Find this compound or compounds like it in BindingDB:
Activity Spreadsheet -- Enzyme Inhibition Constant Data from BindingDB
Found 1 hit for monomerid = 22595
TargetEndothelial PAS domain-containing protein 1/Hypoxia-inducible factor 1-alpha(Homo sapiens (Human))
Korea Research Institute Of Bioscience And Biotechnology
Curated by ChEMBL
LigandPNGBDBM22595(3-[2-(4-tert-butylphenoxy)acetamido]benzoic acid |...)
Affinity DataIC50:  2.90E+4nM. Assay description: Inhibition of hypoxia induced HIF1 transcriptional activity in human Hep3B cells by cell-based HRE reporter assay
In DepthDetails ArticlePubMed
Activity Spreadsheet -- ITC Data from BindingDB
Found 1 hit for monomerid = 22595
CellHIV-1 Nef(Human immunodeficiency virus type 1 (isolate BRU/L...)
Centre National De La Recherche Scientifique
SyringePNGBDBM22595(3-[2-(4-tert-butylphenoxy)acetamido]benzoic acid |...)
ITC DataΔG°: -8.17kcal/mole −TΔS°: -7.41kcal/mole ΔH°: -0.764kcal/mole logk: 1.02E+6
pH: 7.0 T: 25.00°C