BDBM226025 GTC000013A
SMILES COC(=O)CN([C@H]1CCN([C@@H](C)C(=O)N2CCOCC2)C1=O)S(=O)(=O)\C=C\c1ccc(Cl)cc1
InChI Key InChIKey=ZLGPXHQZLGUYEO-WTCBMFSRSA-N
Data  1 IC50
  Tab Delimited (TSV)   2D SDfile   Computed 3D by Vconf -m prep SDfile
Find this compound or compounds like it in BindingDB:
Activity Spreadsheet -- Enzyme Inhibition Constant Data from BindingDB
Found 1 hit for monomerid = 226025
TargetCoagulation factor X(Homo sapiens (Human))
D3R/Abbott
LigandPNGBDBM226025(GTC000013A)
Affinity DataIC50:  60nM. Assay description: D3R245
Ligand InfoPC cidPC sid
In DepthDetails PubMed