BDBM226043 GTC000030A
SMILES C[C@H](N1CC[C@H](N(CC(N)=O)S(=O)(=O)\C=C\c2ccc(Cl)cc2)C1=O)C(=O)N1CCOCC1
InChI Key InChIKey=UKXUKYYQADFHCP-KUJPFMKMSA-N
Data  1 IC50
  Tab Delimited (TSV)   2D SDfile   Computed 3D by Vconf -m prep SDfile
Find this compound or compounds like it in BindingDB:
Activity Spreadsheet -- Enzyme Inhibition Constant Data from BindingDB
Found 1 hit for monomerid = 226043
TargetCoagulation factor X(Homo sapiens (Human))
D3R/Abbott
LigandPNGBDBM226043(GTC000030A)
Affinity DataIC50:  54nM. Assay description: D3R245
Ligand InfoPC cidPC sid
In DepthDetails PubMed