BDBM226050 GTC000038A
SMILES C[C@H](N1CC[C@H](N(CC(N)=O)S(=O)(=O)c2ccc3cc(Cl)ccc3c2)C1=O)C(=O)N1C[C@H](C)O[C@H](C)C1
InChI Key InChIKey=ZIASRVHJMRINIM-GEYWLOKFSA-N
Data  1 IC50
  Tab Delimited (TSV)   2D SDfile   Computed 3D by Vconf -m prep SDfile
Find this compound or compounds like it in BindingDB:
Activity Spreadsheet -- Enzyme Inhibition Constant Data from BindingDB
Found 1 hit for monomerid = 226050
TargetCoagulation factor X(Homo sapiens (Human))
D3R/Abbott
LigandPNGBDBM226050(GTC000038A)
Affinity DataIC50:  26.5nM. Assay description: D3R245
Ligand InfoPC cidPC sid
In DepthDetails PubMed