BDBM226058 GTC000045A
SMILES C[C@H](N1CC[C@H](N(C)S(=O)(=O)CCc2ccc(Cl)s2)C1=O)C(=O)N1CCOCC1
InChI Key InChIKey=MYJHFLFZMIRTBU-ZFWWWQNUSA-N
Data  1 IC50
  Tab Delimited (TSV)   2D SDfile   Computed 3D by Vconf -m prep SDfile
Find this compound or compounds like it in BindingDB:
Activity Spreadsheet -- Enzyme Inhibition Constant Data from BindingDB
Found 1 hit for monomerid = 226058
TargetCoagulation factor X(Homo sapiens (Human))
D3R/Abbott
LigandPNGBDBM226058(GTC000045A)
Affinity DataIC50:  95.1nM. Assay description: D3R246
Ligand InfoPC cidPC sid
In DepthDetails PubMed