BDBM226080 GTC000067A
SMILES CN(CCc1c[nH]cn1)C(=O)c1ccc(N2CC[C@H](NS(=O)(=O)\C=C\c3ccc(Cl)s3)C2=O)c(F)c1
InChI Key InChIKey=NJEOFPIBRORNLV-BLRBJFNZSA-N
Data  1 IC50
  Tab Delimited (TSV)   2D SDfile   Computed 3D by Vconf -m prep SDfile
Find this compound or compounds like it in BindingDB:
Activity Spreadsheet -- Enzyme Inhibition Constant Data from BindingDB
Found 1 hit for monomerid = 226080
TargetCoagulation factor X(Homo sapiens (Human))
D3R/Abbott
LigandPNGBDBM226080(GTC000067A)
Affinity DataIC50:  603nM. Assay description: D3R246
Ligand InfoPC cidPC sid
In DepthDetails PubMed