BDBM22745 1-(2-chlorophenyl)-2-(3,4-dimethoxyphenyl)ethane-1,2-dione::Benzil-based compound, 23
SMILES COc1ccc(cc1OC)C(=O)C(=O)c1ccccc1Cl
InChI Key InChIKey=ULVSCSFZMZRZHJ-UHFFFAOYSA-N
Data  6 KI
  Tab Delimited (TSV)   2D SDfile   Computed 3D by Vconf -m prep SDfile
Find this compound or compounds like it in BindingDB:
Activity Spreadsheet -- Enzyme Inhibition Constant Data from BindingDB
Found 6 hits for monomerid = 22745
TargetCoagulation factor XII(Homo sapiens (Human))
University Of Mississippi
LigandPNGBDBM22745(1-(2-chlorophenyl)-2-(3,4-dimethoxyphenyl)ethane-1...)
Affinity DataKi:  8.90nM ΔG°:  -11.0kcal/molepH: 7.4 T: 2°C. Assay description: CE inhibition was determined using a spectrophotometric multiwell plate assay with o-NPA as a substrate. The rate of change in absorbance at 420 nm w...
In DepthDetails ArticlePubMed
TargetLiver carboxylesterase 1(Oryctolagus cuniculus (rabbit))
University Of Mississippi
LigandPNGBDBM22745(1-(2-chlorophenyl)-2-(3,4-dimethoxyphenyl)ethane-1...)
Affinity DataKi:  36nM. Assay description: CE inhibition was determined using a spectrophotometric multiwell plate assay with o-NPA as a substrate. The rate of change in absorbance at 420 nm w...
In DepthDetails ArticlePubMed
TargetLiver carboxylesterase 1(Homo sapiens (Human))
University Of Mississippi
LigandPNGBDBM22745(1-(2-chlorophenyl)-2-(3,4-dimethoxyphenyl)ethane-1...)
Affinity DataKi:  3.30E+3nM. Assay description: CE inhibition was determined using a spectrophotometric multiwell plate assay with o-NPA as a substrate. The rate of change in absorbance at 420 nm w...
In DepthDetails ArticlePubMed
TargetLiver carboxylesterase 1(Homo sapiens (Human))
University Of Mississippi
LigandPNGBDBM22745(1-(2-chlorophenyl)-2-(3,4-dimethoxyphenyl)ethane-1...)
Affinity DataKi:  3.31E+3nM. Assay description: Inhibition of human carboxylesterase 1
In DepthDetails ArticlePubMed
TargetAcetylcholinesterase(Homo sapiens (Human))
University Of Mississippi
LigandPNGBDBM22745(1-(2-chlorophenyl)-2-(3,4-dimethoxyphenyl)ethane-1...)
Affinity DataKi: >1.00E+5nM. Assay description: The cholinesterase assays were performed using colorimetric method reported by Ellman. Estimates of the competitive inhibition constants (Ki) were ob...
In DepthDetails ArticlePubMed
TargetCholinesterase(Homo sapiens (Human))
University Of Mississippi
LigandPNGBDBM22745(1-(2-chlorophenyl)-2-(3,4-dimethoxyphenyl)ethane-1...)
Affinity DataKi: >1.00E+5nM. Assay description: The cholinesterase assays were performed using colorimetric method reported by Ellman. Estimates of the competitive inhibition constants (Ki) were ob...
In DepthDetails ArticlePubMed