BDBM227669 5-{6-(5-chloropyridin-3- yl)-8-[1-fluoro-1-(3- fluoropyridin-2-yl)ethyl]- 7-[(trans-4- methylcyclohexyl)methyl]- 7h-purin-2-yl}-1,3,4- oxadiazol-2(3h)-one (enantiomer 1)::US9540377, 23.84::US9540377, 23.85
SMILES C[C@H]1CC[C@H](Cn2c(nc3nc(nc(-c4cncc(Cl)c4)c23)-c2n[nH]c(=O)o2)C(C)(F)c2ncccc2F)CC1
InChI Key
Data  2 IC50
  Tab Delimited (TSV)   2D SDfile   Computed 3D by Vconf -m prep SDfile
Find this compound or compounds like it in BindingDB:
Activity Spreadsheet -- Enzyme Inhibition Constant Data from BindingDB
Found 2 hits for monomerid = 227669
TargetE3 ubiquitin-protein ligase Mdm2 [17-125](Homo sapiens (Human))
Merck Sharp & Dohme
US Patent
LigandPNGBDBM227669(5-{6-(5-chloropyridin-3- yl)-8-[1-fluoro-1-(3- flu...)
Affinity DataIC50:  0.359nMT: 2°C. Assay description: An HDM2 FRET assay was developed to assess the compounds' inhibitory activity towards binding of p53 protein. A truncated version of HDM2 with re...
Ligand InfoPC cidPC sid
In DepthDetails US Patent
TargetE3 ubiquitin-protein ligase Mdm2 [17-125](Homo sapiens (Human))
Merck Sharp & Dohme
US Patent
LigandPNGBDBM227669(5-{6-(5-chloropyridin-3- yl)-8-[1-fluoro-1-(3- flu...)
Affinity DataIC50:  16.5nMT: 2°C. Assay description: An HDM2 FRET assay was developed to assess the compounds' inhibitory activity towards binding of p53 protein. A truncated version of HDM2 with re...
Ligand InfoPC cidPC sid
In DepthDetails US Patent