BDBM228176 2-(3-tert-Butyl-[1,2,4]triazol-1-yl)-1-{(R)-4-[4-(2-ethoxy-pyrimidin-5-yl)-2-trifluoromethyl-thiazol-5-yl]-2-methyl-piperazin-1-yl}-ethanone::US10047080, 3
SMILES CCOc1ncc(cn1)-c1cc(sc1C1CNCC(C)N1C(=O)Cn1cnc(n1)C(C)(C)C)C(F)(F)F
InChI Key InChIKey=LXQYQEOQGGLOJZ-UHFFFAOYSA-N
Data  2 IC50
  Tab Delimited (TSV)   2D SDfile   Computed 3D by Vconf -m prep SDfile
Find this compound or compounds like it in BindingDB:
Activity Spreadsheet -- Enzyme Inhibition Constant Data from BindingDB
Found 2 hits for monomerid = 228176
TargetC-X-C chemokine receptor type 3(Homo sapiens (Human))
Idorsia Pharmaceuticals
US Patent
LigandPNGBDBM228176(2-(3-tert-Butyl-[1,2,4]triazol-1-yl)-1-{(R)-4-[4-(...)
Affinity DataIC50:  552nM. Assay description: Stock solutions of test compounds are made up at a concentration of 10 mM in DMSO, and serially diluted in PBS containing 0.5% BSA to concentrations ...
Ligand InfoPC cidPC sid
In DepthDetails US Patent
TargetC-X-C chemokine receptor type 3(Homo sapiens (Human))
Idorsia Pharmaceuticals
US Patent
LigandPNGBDBM228176(2-(3-tert-Butyl-[1,2,4]triazol-1-yl)-1-{(R)-4-[4-(...)
Affinity DataIC50:  1nMpH: 7.4Assay Description:The bioactivity of compounds is tested in a fluorometric imaging plate reader (FLIPR: Molecular Devices) using engineered CHO-K1 cells expressing the...
Ligand InfoPC cidPC sid
In DepthDetails US Patent