BDBM228177 1-{(R)-4-[4-(2-Ethoxy-pyrimidin-5-yl)-2-trifluoromethyl-thiazol-5-yl]-2-methyl-piperazin-1-yl}-2-(3-methoxymethyl-[1,2,4]triazol-1-yl)-ethanone::US10047080, 4
SMILES CCOc1ncc(cn1)-c1cc(sc1C1CNCC(C)N1C(=O)Cn1cnc(COC)n1)C(F)(F)F
InChI Key InChIKey=FLMHZOQWFSPPPC-UHFFFAOYSA-N
Data  2 IC50
  Tab Delimited (TSV)   2D SDfile   Computed 3D by Vconf -m prep SDfile
Find this compound or compounds like it in BindingDB:
Activity Spreadsheet -- Enzyme Inhibition Constant Data from BindingDB
Found 2 hits for monomerid = 228177
TargetC-X-C chemokine receptor type 3(Homo sapiens (Human))
Idorsia Pharmaceuticals
US Patent
LigandPNGBDBM228177(1-{(R)-4-[4-(2-Ethoxy-pyrimidin-5-yl)-2-trifluorom...)
Affinity DataIC50:  950nM. Assay description: Stock solutions of test compounds are made up at a concentration of 10 mM in DMSO, and serially diluted in PBS containing 0.5% BSA to concentrations ...
Ligand InfoPC cidPC sid
In DepthDetails US Patent
TargetC-X-C chemokine receptor type 3(Homo sapiens (Human))
Idorsia Pharmaceuticals
US Patent
LigandPNGBDBM228177(1-{(R)-4-[4-(2-Ethoxy-pyrimidin-5-yl)-2-trifluorom...)
Affinity DataIC50:  13nMpH: 7.4Assay Description:The bioactivity of compounds is tested in a fluorometric imaging plate reader (FLIPR: Molecular Devices) using engineered CHO-K1 cells expressing the...
Ligand InfoPC cidPC sid
In DepthDetails US Patent